BDBM50203391 CHEMBL233578::naphthalene-1-carboxylic acid [1-(4-methyl-benzyl)-piperidin-4-yl]-amide
SMILES Cc1ccc(CN2CCC(CC2)NC(=O)c2cccc3ccccc23)cc1
InChI Key InChIKey=ROVYURHDYDKHRR-UHFFFAOYSA-N
Data  1 KI
  Tab Delimited (TSV)   2D SDfile   Computed 3D by Vconf -m prep SDfile
Find this compound or compounds like it in BindingDB:
Activity Spreadsheet -- Enzyme Inhibition Constant Data from BindingDB
Found 1 hit for monomerid = 50203391
TargetD(4) dopamine receptor(Homo sapiens (Human))
Université
Curated by ChEMBL
LigandPNGBDBM50203391(CHEMBL233578 | naphthalene-1-carboxylic acid [1-(4...)
Affinity DataKi:  69nM. Assay description: Displacement of [3H]nemonapride from human cloned dopamine D4.2 receptor
In DepthDetails ArticlePubMed